{"text_format":"1","workbook":"xlsx","n_sheets":9,"sheets":["Info","Readme","1- INPUTS","2-LCI","3-LCIA","4-SensAnalysis","5-LCOE-LCOF","DB","Abbr&References"],"not_rendered":{"charts":9,"images":12,"macros":0,"external_links":1,"defined_names":137,"comments":0,"pivot_tables":0},"unopened":[],"bounds":{"document_bytes":16777216,"sheet_cells":100000,"rows_first":2000,"rows_last":500,"rows_between":2000,"halvings":0,"cell_chars":16384,"cell_head_chars":4096},"cells_cut":0,"cells_raw":0,"read":"whole","date_system":"1900"}

{"sheet":"Info","index":0,"n_rows":81,"n_cols":5,"rows_kept":81,"cut":false,"hidden":false,"merged":[[80,2,80,8],[57,2,62,8],[52,2,55,8],[1,2,7,3],[1,4,7,8],[47,2,50,8],[8,2,8,8],[9,2,14,8],[16,2,19,8],[64,2,68,8],[76,2,77,8],[71,2,74,8],[69,2,69,8],[78,2,79,8]]}
[]
[null,null,null,null,"FCEC v. 1.0 - A Streamlined Sustainability Assessment Tool for high temperature fuel cells"]
[]
[]
[]
[]
[]
[]
[]
[null,null,"Objective: The aim of FCEC tool is to provide a simple tool to enable the simulation of inputs and calculation process for environmental impacts and economic analysis power-togas-to-power- (P2G2P) via high temperature fuel cells, an emerging technology. This version is adapted for High temperature Fuel Cells, although it could be used for any other energy system if inventory flows are properly identified."]
[]
[]
[]
[]
[]
{"$rows_left_out":67}
{"sheet":"Readme","index":1,"n_rows":0,"n_cols":0,"rows_kept":0,"cut":false,"hidden":false,"merged":[]}

{"sheet":"1- INPUTS","index":2,"n_rows":117,"n_cols":4,"rows_kept":117,"cut":false,"hidden":false,"merged":[[112,1,112,3],[100,1,100,3],[97,1,97,3],[2,2,2,3],[3,2,3,3],[4,2,4,3],[7,1,7,3],[59,1,59,3],[37,1,37,3],[9,1,9,3],[78,1,78,3],[108,1,108,3],[6,2,6,3],[0,1,0,3],[1,2,1,3],[1,1,5,1],[5,2,5,3]]}
[null,"DATA INPUT "]
[null,null,"Key code"]
[null,null,"Input - Drop-down boxes"]
[null,null," Input - User data "]
[null,null,"Input data (Default values)"]
[null,null,"Calculated values"]
[null,null,"Not applicable in Fuel Cell or Electrolysis mode"]
[]
[null,"Data input","Input data module"]
[null,"General data"]
[null,"FC technology studied","SOFC PLANAR","dimensionless"]
[null,"Gross Electrical Capacity ",0,"kWe"]
[null,"Total Installed Cost",0,"€/kW"]
[null,{"$f":"+IF(C11=\"ReSOFC\",\"NOT APPLICABLE IN ELECTROLYSIS MODE\",\"Thermal capacity\")","v":"Thermal capacity"},{"$f":"+(GrossElCapacity/Systemefficiency)*Thermalefficiency","v":0},"kWth"]
[null,{"$f":"++IF(C11=\"ReSOFC\",\"NOT APPLICABLE IN ELECTROLYSIS MODE\",\"System efficiency (LHV)\")","v":"System efficiency (LHV)"},0.6,"decimal"]
{"$rows_left_out":103}
{"sheet":"2-LCI","index":3,"n_rows":129,"n_cols":6,"rows_kept":129,"cut":false,"hidden":false,"merged":[[0,1,0,5],[86,1,88,1],[89,1,90,1],[91,1,93,1],[1,2,5,2],[1,3,1,5],[2,3,2,5],[3,3,3,5],[4,3,4,5],[5,3,5,5],[9,1,9,2],[63,1,71,1],[8,1,8,2],[6,3,6,5],[73,1,76,1],[77,1,80,1],[1,0,10,0],[123,1,128,1],[122,3,122,4],[98,1,101,1],[123,4,128,4],[103,1,115,1],[116,1,121,1],[94,1,96,1],[81,1,85,1],[11,1,62,1],[7,3,7,5]]}
[null,"LIFE CYCLE INVENTORY CALCULATION (LCI)"]
[null,null,null,"Key code"]
[null,null,null,"Drop-down boxes"]
[null,null,null,"User Input data "]
[null,null,null,"Input data (Default values)"]
[null,null,null,"Calculated values"]
[null,null,null,"Not applicable in Fuel Cell or Electrolysis mode"]
[null,null,null,"Values equal to zero"]
[null,"Technology",null,{"$f":"+'1- INPUTS'!C11","v":"SOFC PLANAR"}]
[null,"Material/Process input",null,"LCI data module"]
[null,"Component","Material/Process input","Fuel cell manufacturing","Your input","Unit"]
[null,"Stack manufacturing",{"$f":"+DB!C61","v":"LaMnO₃ powder"},{"$f":"+IF(E12>0,E12,DB!G61)","v":0},0,"kg"]
[null,null,{"$f":"+DB!C62","v":"LaCrO₃ powder"},{"$f":"+IF(E13>0,E13,DB!G62)","v":0},0,"kg"]
[null,null,{"$f":"+DB!C63","v":"Zirconium chloride powder"},{"$f":"+IF(E14>0,E14,DB!G63)","v":0},0,"kg"]
[null,null,{"$f":"+DB!C64","v":"Yttrium chloride powder"},{"$f":"+IF(E15>0,E15,DB!G64)","v":0},0,"kg"]
{"$rows_left_out":115}
{"sheet":"3-LCIA","index":4,"n_rows":151,"n_cols":24,"rows_kept":151,"cut":false,"hidden":false,"merged":[[60,2,62,2],[108,2,108,25],[126,2,126,25],[139,2,139,25],[141,2,143,2],[60,4,60,20],[60,21,60,23],[142,3,143,3],[128,2,130,2],[73,21,73,23],[92,4,92,20],[92,21,92,23],[110,4,110,20],[110,21,110,23],[0,2,0,25],[58,2,58,25],[89,2,89,25],[73,2,75,2],[141,4,141,20],[141,21,141,23],[74,3,75,3],[129,3,130,3],[73,4,73,20],[61,3,62,3],[111,3,112,3],[93,3,94,3],[128,21,128,23],[128,4,128,20],[92,2,94,2],[110,2,112,2]]}
[null,null,"LIFE CYCLE IMPACT ASSESSMENT  (LCIA) - LCA ReCiPe 2016 (Hierarchist perspective)"]
[]
[]
[]
[]
[]
[]
[]
[]
[]
[]
[]
[]
[]
[]
{"$rows_left_out":137}
{"sheet":"4-SensAnalysis","index":5,"n_rows":27,"n_cols":23,"rows_kept":27,"cut":false,"hidden":false,"merged":[[19,16,20,16],[19,20,20,20],[19,21,20,21],[19,22,20,22],[19,17,20,17],[19,18,20,18],[19,19,20,19],[19,2,20,2],[19,12,20,12],[19,13,20,13],[19,14,20,14],[19,15,20,15],[19,7,20,7],[19,8,20,8],[19,9,20,9],[19,10,20,10],[19,11,20,11],[19,3,20,3],[19,4,20,4],[19,5,20,5],[19,6,20,6]]}
[]
["This page is designed to store the data of LCIA simulations and different scenarios. "]
[]
[]
[]
[]
[null,null,null,"Global warming","Stratospheric ozone depletion","Ionizing radiation","Ozone formation, Human health","Fine particulate matter formation","Ozone formation, Terrestrial ecosystems","Terrestrial acidification","Freshwater eutrophication","Terrestrial ecotoxicity","Freshwater ecotoxicity","Marine ecotoxicity","Human carcinogenic toxicity","Human non-carcinogenic toxicity","Land use","Mineral resource scarcity","Fossil resource scarcity","Water consumption","Human Health","Ecosystem ","Resource availability"]
[null,null,"SCENARIOS","GWP","ODP","IRP","HOFP","PMFP","EOFP","TAP","FEP","TETP","FETP","METP","HTPc","HTPnc","LOP","SOP","FFP","WCP","HH","EQ","RA"]
[null,null,"Baseline"]
[null,null,"Alternative A"]
[null,null,"Alternative B"]
[null,null,"Alternative C"]
[null,null,"Alternative D"]
[]
[]
{"$rows_left_out":13}
{"sheet":"5-LCOE-LCOF","index":6,"n_rows":59,"n_cols":11,"rows_kept":59,"cut":false,"hidden":false,"merged":[[51,4,51,5],[50,4,50,5],[48,4,48,5],[57,4,57,5],[56,4,56,5],[55,4,55,5],[54,4,54,5],[53,4,53,5],[58,4,58,5],[0,1,0,24],[7,1,7,24],[33,1,33,23],[49,2,50,2],[49,3,50,3],[20,2,20,3],[27,2,28,2],[27,3,28,3],[26,4,26,5],[23,4,23,5],[24,4,24,5],[25,4,25,5],[31,2,31,24],[49,4,49,5],[52,4,52,5],[18,4,18,5],[19,4,19,5],[20,4,20,5],[21,4,21,5],[22,4,22,5]]}
[null,"TECHNO-ECONOMIC ANALYSIS"]
[]
[]
[null,null,"Key code"]
[null,null," Input - User data "]
[null,null,"Calculated values"]
[]
[null,"LEVELIZED COST OF ELECTRICITY (LCOE)"]
[]
[null,null,"Analyzed system",{"$f":"+'1- INPUTS'!C11","v":"SOFC PLANAR"},"Sensitivity analysis","Variation","S1","S2","BASELINE","S3","S4"]
[null,null,"Investment cost (€/kW)",{"$f":"+IF('1- INPUTS'!C$11=\"ReSOFC\",0,TIC)","v":0},"Investment cost",0,{"$f":"+DB!C296","v":{"$error":"#DIV/0!"}},{"$f":"+DB!D296","v":{"$error":"#DIV/0!"}},{"$f":"+DB!E296","v":{"$error":"#DIV/0!"}},{"$f":"+DB!F296","v":{"$error":"#DIV/0!"}},{"$f":"+DB!G296","v":{"$error":"#DIV/0!"}}]
[null,null,"WACC (%)",{"$f":"+IF('1- INPUTS'!C$11=\"ReSOFC\",0,0.12)","v":0.12},"WACC",0,{"$f":"+DB!C299","v":{"$error":"#DIV/0!"}},{"$f":"+DB!D299","v":{"$error":"#DIV/0!"}},{"$f":"+DB!E299","v":{"$error":"#DIV/0!"}},{"$f":"+DB!F299","v":{"$error":"#DIV/0!"}},{"$f":"+DB!G299","v":{"$error":"#DIV/0!"}}]
[null,null,"Technical lifetime of plant (years)",{"$f":"+IF('1- INPUTS'!C$11=\"ReSOFC\",0,System_Lifetime)","v":0},"Lifetime",0,{"$f":"+DB!C302","v":{"$error":"#DIV/0!"}},{"$f":"+DB!D302","v":{"$error":"#DIV/0!"}},{"$f":"+DB!E302","v":{"$error":"#DIV/0!"}},{"$f":"+DB!F302","v":{"$error":"#DIV/0!"}},{"$f":"+DB!G302","v":{"$error":"#DIV/0!"}}]
[null,null,"Fix operating cost (€/kW/year)",{"$f":"1/3*D11/Stack_Lifetime","v":{"$error":"#DIV/0!"}},"Fix operating cost",0,{"$f":"+DB!C305","v":{"$error":"#DIV/0!"}},{"$f":"+DB!D305","v":{"$error":"#DIV/0!"}},{"$f":"+DB!E305","v":{"$error":"#DIV/0!"}},{"$f":"+DB!F305","v":{"$error":"#DIV/0!"}},{"$f":"+DB!G305","v":{"$error":"#DIV/0!"}}]
[null,null,"Variable operating cost (€/MWhel)",2,"Fuel cost",0,{"$f":"+DB!C308","v":{"$error":"#DIV/0!"}},{"$f":"+DB!D308","v":{"$error":"#DIV/0!"}},{"$f":"+DB!E308","v":{"$error":"#DIV/0!"}},{"$f":"+DB!F308","v":{"$error":"#DIV/0!"}},{"$f":"+DB!G308","v":{"$error":"#DIV/0!"}}]
{"$rows_left_out":45}
{"sheet":"DB","index":7,"n_rows":526,"n_cols":33,"rows_kept":526,"cut":false,"hidden":false,"merged":[[472,2,473,24],[370,2,370,6],[376,2,376,6],[359,2,360,24],[311,2,311,6],[314,2,314,6],[373,2,373,6],[364,2,364,6],[367,2,367,6],[361,2,361,6],[380,2,380,6],[383,2,383,6],[387,2,387,6],[390,2,390,6],[394,2,394,6],[397,2,397,6],[308,2,308,6],[150,3,150,23],[159,3,159,23],[155,3,155,23],[292,2,292,24],[164,3,164,23],[293,2,293,6],[296,2,296,6],[299,2,299,6],[302,2,302,6],[305,2,305,6],[181,6,182,6],[42,2,42,23],[5,2,6,26],[7,2,7,26],[9,2,9,26],[129,3,129,26],[118,3,118,26],[48,2,48,26],[131,3,131,23],[137,3,137,23],[143,3,143,23],[58,2,58,23],[115,2,115,23]]}
[]
[]
[]
[]
[null,null,null,null,null,null,null,2,{"$f":"+H5+1","v":3},{"$f":"+I5+1","v":4},5,6,7,8,9,10,11,12,13,14,15,16,17,18,19,20,21]
[null,null,"TOOL SUPPORT CALCULATION"]
[]
[null,null,"ENVIRONMENTAL IMPACT ASSESSMENT"]
[null,null,null,null,null,null,null,"GWP","ODP","IRP","EOFP","PMFP","HOFP","TAP","FEP","TETP","FETP","METP","HTPc","HTPnc","LOP","SOP","FFP","WCP","HH","ED","RA"]
[null,null,"Operation"]
[null,null,null,null,null,null,"NATURAL GAS",1.8468886E-2,1.7505907000000002E-8,1.8783111999999999E-4,2.9262826000000002E-5,8.8810117999999998E-6,3.1952100000000002E-5,3.7155032E-5,4.1437043E-7,1.2296321E-6,3.2348156999999999E-5,1.3489831999999999E-4,3.0175420000000001E-4,3.5276624999999999E-2,3.2224989000000001E-5,2.0034801999999999E-5,2.6341566E-2,3.3230097999999999E-3,3.1362210000000001E-8,1.0927569E-10,9.4302029000000002E-3]
[null,null,null,null,null,null,"METHANE FROM BIOGAS",5.9285921999999998E-2,8.0347853999999999E-8,1.3670583E-2,2.1560464999999999E-5,1.3256849000000001E-5,2.2264518999999999E-5,7.4357260999999994E-5,5.2292064000000002E-6,1.4058613E-5,6.2180250000000003E-4,8.7462398000000003E-4,8.2140629000000004E-4,0.59062935999999999,2.4445529000000001E-4,1.4271353000000001E-4,4.0146293000000001E-3,0.18308311999999999,3.1362210000000001E-8,1.0927569E-10,9.4302029000000002E-3]
[null,null,null,null,null,null,"Calculated fuel",{"$f":"+IF('1- INPUTS'!$C$39=$G11,(('2-LCI'!$D106*LHVFuel_2*System_Lifetime)/(Product_Generated*System_Lifetime)*H11),(('2-LCI'!$D106*LHVFuel_2*System_Lifetime)/(Product_Generated*System_Lifetime)*H12))","v":{"$error":"#DIV/0!"}},{"$f":"+IF('1- INPUTS'!$C$39=$G11,(('2-LCI'!$D106*LHVFuel_2*System_Lifetime)/(Product_Generated*System_Lifetime)*I11),(('2-LCI'!$D106*LHVFuel_2*System_Lifetime)/(Product_Generated*System_Lifetime)*I12))","v":{"$error":"#DIV/0!"}},{"$f":"+IF('1- INPUTS'!$C$39=$G11,(('2-LCI'!$D106*LHVFuel_2*System_Lifetime)/(Product_Generated*System_Lifetime)*J11),(('2-LCI'!$D106*LHVFuel_2*System_Lifetime)/(Product_Generated*System_Lifetime)*J12))","v":{"$error":"#DIV/0!"}},{"$f":"+IF('1- INPUTS'!$C$39=$G11,(('2-LCI'!$D106*LHVFuel_2*System_Lifetime)/(Product_Generated*System_Lifetime)*K11),(('2-LCI'!$D106*LHVFuel_2*System_Lifetime)/(Product_Generated*System_Lifetime)*K12))","v":{"$error":"#DIV/0!"}},{"$f":"+IF('1- INPUTS'!$C$39=$G11,(('2-LCI'!$D106*LHVFuel_2*System_Lifetime)/(Product_Generated*System_Lifetime)*L11),(('2-LCI'!$D106*LHVFuel_2*System_Lifetime)/(Product_Generated*System_Lifetime)*L12))","v":{"$error":"#DIV/0!"}},{"$f":"+IF('1- INPUTS'!$C$39=$G11,(('2-LCI'!$D106*LHVFuel_2*System_Lifetime)/(Product_Generated*System_Lifetime)*M11),(('2-LCI'!$D106*LHVFuel_2*System_Lifetime)/(Product_Generated*System_Lifetime)*M12))","v":{"$error":"#DIV/0!"}},{"$f":"+IF('1- INPUTS'!$C$39=$G11,(('2-LCI'!$D106*LHVFuel_2*System_Lifetime)/(Product_Generated*System_Lifetime)*N11),(('2-LCI'!$D106*LHVFuel_2*System_Lifetime)/(Product_Generated*System_Lifetime)*N12))","v":{"$error":"#DIV/0!"}},{"$f":"+IF('1- INPUTS'!$C$39=$G11,(('2-LCI'!$D106*LHVFuel_2*System_Lifetime)/(Product_Generated*System_Lifetime)*O11),(('2-LCI'!$D106*LHVFuel_2*System_Lifetime)/(Product_Generated*System_Lifetime)*O12))","v":{"$error":"#DIV/0!"}},{"$f":"+IF('1- INPUTS'!$C$39=$G11,(('2-LCI'!$D106*LHVFuel_2*System_Lifetime)/(Product_Generated*System_Lifetime)*P11),(('2-LCI'!$D106*LHVFuel_2*System_Lifetime)/(Product_Generated*System_Lifetime)*P12))","v":{"$error":"#DIV/0!"}},{"$f":"+IF('1- INPUTS'!$C$39=$G11,(('2-LCI'!$D106*LHVFuel_2*System_Lifetime)/(Product_Generated*System_Lifetime)*Q11),(('2-LCI'!$D106*LHVFuel_2*System_Lifetime)/(Product_Generated*System_Lifetime)*Q12))","v":{"$error":"#DIV/0!"}},{"$f":"+IF('1- INPUTS'!$C$39=$G11,(('2-LCI'!$D106*LHVFuel_2*System_Lifetime)/(Product_Generated*System_Lifetime)*R11),(('2-LCI'!$D106*LHVFuel_2*System_Lifetime)/(Product_Generated*System_Lifetime)*R12))","v":{"$error":"#DIV/0!"}},{"$f":"+IF('1- INPUTS'!$C$39=$G11,(('2-LCI'!$D106*LHVFuel_2*System_Lifetime)/(Product_Generated*System_Lifetime)*S11),(('2-LCI'!$D106*LHVFuel_2*System_Lifetime)/(Product_Generated*System_Lifetime)*S12))","v":{"$error":"#DIV/0!"}},{"$f":"+IF('1- INPUTS'!$C$39=$G11,(('2-LCI'!$D106*LHVFuel_2*System_Lifetime)/(Product_Generated*System_Lifetime)*T11),(('2-LCI'!$D106*LHVFuel_2*System_Lifetime)/(Product_Generated*System_Lifetime)*T12))","v":{"$error":"#DIV/0!"}},{"$f":"+IF('1- INPUTS'!$C$39=$G11,(('2-LCI'!$D106*LHVFuel_2*System_Lifetime)/(Product_Generated*System_Lifetime)*U11),(('2-LCI'!$D106*LHVFuel_2*System_Lifetime)/(Product_Generated*System_Lifetime)*U12))","v":{"$error":"#DIV/0!"}},{"$f":"+IF('1- INPUTS'!$C$39=$G11,(('2-LCI'!$D106*LHVFuel_2*System_Lifetime)/(Product_Generated*System_Lifetime)*V11),(('2-LCI'!$D106*LHVFuel_2*System_Lifetime)/(Product_Generated*System_Lifetime)*V12))","v":{"$error":"#DIV/0!"}},{"$f":"+IF('1- INPUTS'!$C$39=$G11,(('2-LCI'!$D106*LHVFuel_2*System_Lifetime)/(Product_Generated*System_Lifetime)*W11),(('2-LCI'!$D106*LHVFuel_2*System_Lifetime)/(Product_Generated*System_Lifetime)*W12))","v":{"$error":"#DIV/0!"}},{"$f":"+IF('1- INPUTS'!$C$39=$G11,(('2-LCI'!$D106*LHVFuel_2*System_Lifetime)/(Product_Generated*System_Lifetime)*X11),(('2-LCI'!$D106*LHVFuel_2*System_Lifetime)/(Product_Generated*System_Lifetime)*X12))","v":{"$error":"#DIV/0!"}},{"$f":"+IF('1- INPUTS'!$C$39=$G11,(('2-LCI'!$D106*LHVFuel_2*System_Lifetime)/(Product_Generated*System_Lifetime)*Y11),(('2-LCI'!$D106*LHVFuel_2*System_Lifetime)/(Product_Generated*System_Lifetime)*Y12))","v":{"$error":"#DIV/0!"}},{"$f":"+IF('1- INPUTS'!$C$39=$G11,(('2-LCI'!$D106*LHVFuel_2*System_Lifetime)/(Product_Generated*System_Lifetime)*Z11),(('2-LCI'!$D106*LHVFuel_2*System_Lifetime)/(Product_Generated*System_Lifetime)*Z12))","v":{"$error":"#DIV/0!"}},{"$f":"+IF('1- INPUTS'!$C$39=$G11,(('2-LCI'!$D106*LHVFuel_2*System_Lifetime)/(Product_Generated*System_Lifetime)*AA11),(('2-LCI'!$D106*LHVFuel_2*System_Lifetime)/(Product_Generated*System_Lifetime)*AA12))","v":{"$error":"#DIV/0!"}}]
[null,null,null,null,null,null,"Fuel consumption",{"$f":"+IF('1- INPUTS'!$C$54=\"No allocation\",H13,IF('1- INPUTS'!$C$54=\"Allocation exergy\",H13*ELALLF,IF('1- INPUTS'!$C$54=\"Allocation energy\",H13*ELALLF)))","v":{"$error":"#DIV/0!"}},{"$f":"+IF('1- INPUTS'!$C$54=\"No allocation\",I13,IF('1- INPUTS'!$C$54=\"Allocation exergy\",I13*ELALLF,IF('1- INPUTS'!$C$54=\"Allocation energy\",I13*ELALLF)))","v":{"$error":"#DIV/0!"}},{"$f":"+IF('1- INPUTS'!$C$54=\"No allocation\",J13,IF('1- INPUTS'!$C$54=\"Allocation exergy\",J13*ELALLF,IF('1- INPUTS'!$C$54=\"Allocation energy\",J13*ELALLF)))","v":{"$error":"#DIV/0!"}},{"$f":"+IF('1- INPUTS'!$C$54=\"No allocation\",K13,IF('1- INPUTS'!$C$54=\"Allocation exergy\",K13*ELALLF,IF('1- INPUTS'!$C$54=\"Allocation energy\",K13*ELALLF)))","v":{"$error":"#DIV/0!"}},{"$f":"+IF('1- INPUTS'!$C$54=\"No allocation\",L13,IF('1- INPUTS'!$C$54=\"Allocation exergy\",L13*ELALLF,IF('1- INPUTS'!$C$54=\"Allocation energy\",L13*ELALLF)))","v":{"$error":"#DIV/0!"}},{"$f":"+IF('1- INPUTS'!$C$54=\"No allocation\",M13,IF('1- INPUTS'!$C$54=\"Allocation exergy\",M13*ELALLF,IF('1- INPUTS'!$C$54=\"Allocation energy\",M13*ELALLF)))","v":{"$error":"#DIV/0!"}},{"$f":"+IF('1- INPUTS'!$C$54=\"No allocation\",N13,IF('1- INPUTS'!$C$54=\"Allocation exergy\",N13*ELALLF,IF('1- INPUTS'!$C$54=\"Allocation energy\",N13*ELALLF)))","v":{"$error":"#DIV/0!"}},{"$f":"+IF('1- INPUTS'!$C$54=\"No allocation\",O13,IF('1- INPUTS'!$C$54=\"Allocation exergy\",O13*ELALLF,IF('1- INPUTS'!$C$54=\"Allocation energy\",O13*ELALLF)))","v":{"$error":"#DIV/0!"}},{"$f":"+IF('1- INPUTS'!$C$54=\"No allocation\",P13,IF('1- INPUTS'!$C$54=\"Allocation exergy\",P13*ELALLF,IF('1- INPUTS'!$C$54=\"Allocation energy\",P13*ELALLF)))","v":{"$error":"#DIV/0!"}},{"$f":"+IF('1- INPUTS'!$C$54=\"No allocation\",Q13,IF('1- INPUTS'!$C$54=\"Allocation exergy\",Q13*ELALLF,IF('1- INPUTS'!$C$54=\"Allocation energy\",Q13*ELALLF)))","v":{"$error":"#DIV/0!"}},{"$f":"+IF('1- INPUTS'!$C$54=\"No allocation\",R13,IF('1- INPUTS'!$C$54=\"Allocation exergy\",R13*ELALLF,IF('1- INPUTS'!$C$54=\"Allocation energy\",R13*ELALLF)))","v":{"$error":"#DIV/0!"}},{"$f":"+IF('1- INPUTS'!$C$54=\"No allocation\",S13,IF('1- INPUTS'!$C$54=\"Allocation exergy\",S13*ELALLF,IF('1- INPUTS'!$C$54=\"Allocation energy\",S13*ELALLF)))","v":{"$error":"#DIV/0!"}},{"$f":"+IF('1- INPUTS'!$C$54=\"No allocation\",T13,IF('1- INPUTS'!$C$54=\"Allocation exergy\",T13*ELALLF,IF('1- INPUTS'!$C$54=\"Allocation energy\",T13*ELALLF)))","v":{"$error":"#DIV/0!"}},{"$f":"+IF('1- INPUTS'!$C$54=\"No allocation\",U13,IF('1- INPUTS'!$C$54=\"Allocation exergy\",U13*ELALLF,IF('1- INPUTS'!$C$54=\"Allocation energy\",U13*ELALLF)))","v":{"$error":"#DIV/0!"}},{"$f":"+IF('1- INPUTS'!$C$54=\"No allocation\",V13,IF('1- INPUTS'!$C$54=\"Allocation exergy\",V13*ELALLF,IF('1- INPUTS'!$C$54=\"Allocation energy\",V13*ELALLF)))","v":{"$error":"#DIV/0!"}},{"$f":"+IF('1- INPUTS'!$C$54=\"No allocation\",W13,IF('1- INPUTS'!$C$54=\"Allocation exergy\",W13*ELALLF,IF('1- INPUTS'!$C$54=\"Allocation energy\",W13*ELALLF)))","v":{"$error":"#DIV/0!"}},{"$f":"+IF('1- INPUTS'!$C$54=\"No allocation\",X13,IF('1- INPUTS'!$C$54=\"Allocation exergy\",X13*ELALLF,IF('1- INPUTS'!$C$54=\"Allocation energy\",X13*ELALLF)))","v":{"$error":"#DIV/0!"}},{"$f":"+IF('1- INPUTS'!$C$54=\"No allocation\",Y13,IF('1- INPUTS'!$C$54=\"Allocation exergy\",Y13*ELALLF,IF('1- INPUTS'!$C$54=\"Allocation energy\",Y13*ELALLF)))","v":{"$error":"#DIV/0!"}},{"$f":"+IF('1- INPUTS'!$C$54=\"No allocation\",Z13,IF('1- INPUTS'!$C$54=\"Allocation exergy\",Z13*ELALLF,IF('1- INPUTS'!$C$54=\"Allocation energy\",Z13*ELALLF)))","v":{"$error":"#DIV/0!"}},{"$f":"+IF('1- INPUTS'!$C$54=\"No allocation\",AA13,IF('1- INPUTS'!$C$54=\"Allocation exergy\",AA13*ELALLF,IF('1- INPUTS'!$C$54=\"Allocation energy\",AA13*ELALLF)))","v":{"$error":"#DIV/0!"}}]
[]
{"$rows_left_out":512}
{"sheet":"Abbr&References","index":8,"n_rows":71,"n_cols":3,"rows_kept":71,"cut":false,"hidden":false,"merged":[[25,1,25,2],[10,1,10,2],[1,1,1,2]]}
[]
[null,"Information about FC products"]
[null,"SOFC","http://convion.fi/products/"]
[null,"SOFC","https://www.bloomenergy.com/resources"]
[null,"MCFC","http://www.all-energy.co.uk/__novadocuments/80807?v=635633928775100000"]
[null,"MCFC","https://www.energy-saxony.net/fileadmin/Inhalte/Downloads/Pressemitteilungen/Pressefaecher/FCES/alt/FuelCell_product_sheet_DFC250EU_en.pdf"]
[null,"SOEC","https://www.sunfire.de/en/products-and-technology/sunfire-hylink"]
[]
[]
[]
[null,"References"]
[1,"Lee, Y. D., Ahn, K. Y., Morosuk, T., & Tsatsaronis, G. (2015). Environmental impact assessment of a solid-oxide fuel-cell-based combined-heat-and-power-generation system. Energy, 79, 455-466."]
[{"$f":"+A12+1","v":2},"Lozanovski, A., Schuller, O., & Faltenbacher, M. (2011). Guidance document for performing LCA on hydrogen production systems. European Commission-Fuel Cells and Hydrogen Joint Undertaking."]
[{"$f":"+A13+1","v":3},"Masoni, P., & Zamagni, A. (2011). Guidance document for performing LCA on fuel cells. Deliverable D3."]
[4,"Mehmeti, A., Angelis-Dimakis, A., Arampatzis, G., McPhail, S. J., & Ulgiati, S. (2018). Life Cycle Assessment and Water Footprint of Hydrogen Production Methods: From Conventional to Emerging Technologies. Environments, 5(2), 24."]
{"$rows_left_out":56}